Release-Engineering-Kanban Unpointed Tasks

Help.

179188 Video recording for Selenium tests in Node.js In Progress open 2017-10-28 2018-08-09
179188 Video recording for Selenium tests in Node.js In Progress open 2017-10-28 2018-08-09
180171 ArticlePlaceholder should use MediaWiki qunit runner In Progress open 2017-12-02 2018-09-24
180171 ArticlePlaceholder should use MediaWiki qunit runner In Progress open 2017-12-02 2018-09-24
181393 Make sure elasticsearch 6 is supported in phabricator In Progress open 2018-02-01 2018-09-10
181393 Make sure elasticsearch 6 is supported in phabricator In Progress open 2018-02-01 2018-09-10
183512 [EPIC] Migrate Mediawiki jobs from Nodepool to Docker In Progress open 2017-12-22 2018-09-26
183512 [EPIC] Migrate Mediawiki jobs from Nodepool to Docker In Progress open 2017-12-22 2018-09-26
188742 Run tests daily targeting beta cluster for all repositories with Selenium tests In Progress open 2018-03-03 2018-09-14
188742 Run tests daily targeting beta cluster for all repositories with Selenium tests In Progress open 2018-03-03 2018-09-14
189567 Phaseout CI mediawiki config / extensions_load.txt to load extensions In Progress open 2018-03-14 2018-08-01
189567 Phaseout CI mediawiki config / extensions_load.txt to load extensions In Progress open 2018-03-14 2018-08-01
190572 Prepare a disaster recovery plan for failing over from phab1001 to phab2001 (or phab2001 to 1001) In Progress open 2018-03-24 2018-09-10
190572 Prepare a disaster recovery plan for failing over from phab1001 to phab2001 (or phab2001 to 1001) In Progress open 2018-03-24 2018-09-10
190891 Develop canonical/single record of origin, machine readable list of all repos deployed to WMF sites. In Progress open 2018-03-28 2018-09-20
190891 Develop canonical/single record of origin, machine readable list of all repos deployed to WMF sites. In Progress open 2018-03-28 2018-09-20
191771 [REL1_30] Some parserTests fail on debian stretch using Tidy, because of a new version of libtidy In Progress open 2018-04-12 2018-06-15
191771 [REL1_30] Some parserTests fail on debian stretch using Tidy, because of a new version of libtidy In Progress open 2018-04-12 2018-06-15
196093 Review Platform Tech Debt backlog In Progress open 2018-06-01 2018-07-02
196093 Review Platform Tech Debt backlog In Progress open 2018-06-01 2018-07-02
196411 Document scap swat command In Progress open 2018-06-06 2018-09-10
196411 Document scap swat command In Progress open 2018-06-06 2018-09-10
198389 Q1 Selenium framework improvements In Progress open 2018-06-29 2018-09-24
198389 Q1 Selenium framework improvements In Progress open 2018-06-29 2018-09-24
198901 Migrate production services to kubernetes using the pipeline In Progress open 2018-07-06 2018-10-01
198901 Migrate production services to kubernetes using the pipeline In Progress open 2018-07-06 2018-10-01
199113 All repositories with Selenium tests should use wdio-mediawiki In Progress open 2018-07-10 2018-09-05
199113 All repositories with Selenium tests should use wdio-mediawiki In Progress open 2018-07-10 2018-09-05
199130 Fundraising should fall back to non master In Progress open 2018-07-12 2018-09-24
199130 Fundraising should fall back to non master In Progress open 2018-07-12 2018-09-24
199133 Find top 15 target projects that could use Selenium tests to prevent incidents In Progress open 2018-07-10 2018-09-24
199133 Find top 15 target projects that could use Selenium tests to prevent incidents In Progress open 2018-07-10 2018-09-24
204569 Browser Test Failures with Password Blacklist patches In Progress open 2018-09-18 2018-09-25
204569 Browser Test Failures with Password Blacklist patches In Progress open 2018-09-18 2018-09-25
205132 Add Code Health Metrics Working Group members to Code Health mailing list In Progress open 2018-09-22 2018-09-25
205132 Add Code Health Metrics Working Group members to Code Health mailing list In Progress open 2018-09-22 2018-09-25
205902 Disk-space related issues still occurring for Docker based CI jobs In Progress open 2018-10-02 2018-10-01
205902 Disk-space related issues still occurring for Docker based CI jobs In Progress open 2018-10-02 2018-10-01
103351 Jenkins trilead-ssh2 doesn't support our MAC/KEX algorithms In Progress resolved 2017-10-10 2017-10-11
103351 Jenkins trilead-ssh2 doesn't support our MAC/KEX algorithms In Progress resolved 2017-10-10 2017-10-11
112509 scap3 should repack / pack-refs git repos under /srv/deployment In Progress resolved 2017-05-17 2018-01-18
112509 scap3 should repack / pack-refs git repos under /srv/deployment In Progress resolved 2017-05-17 2018-01-18
115755 Rewrite mediawiki-core-doxygen-publish Jenkins job to poll scm instead of being triggered by Zuul In Progress resolved 2018-03-02 2018-03-06
115755 Rewrite mediawiki-core-doxygen-publish Jenkins job to poll scm instead of being triggered by Zuul In Progress resolved 2018-03-02 2018-03-06
155840 Install the BlueOcean plugin on jenkins In Progress resolved 2018-01-02 2018-03-15
155840 Install the BlueOcean plugin on jenkins In Progress resolved 2018-01-02 2018-03-15
164721 Run Selenium tests in CI per-patch for extensions In Progress resolved 2017-05-17 2018-06-29
164721 Run Selenium tests in CI per-patch for extensions In Progress resolved 2017-05-17 2018-06-29
167507 WebdriverIO should run Chrome headlessly In Progress resolved 2018-03-29 2018-04-13
167507 WebdriverIO should run Chrome headlessly In Progress resolved 2018-03-29 2018-04-13
175179 Create selenium-CirrusSearch-jessie daily Jenkins job In Progress resolved 2017-09-29 2018-01-17
175179 Create selenium-CirrusSearch-jessie daily Jenkins job In Progress resolved 2017-09-29 2018-01-17
176747 When jenkins kills a build due to max execution time the docker containers stay running In Progress resolved 2017-11-10 2018-07-02
176747 When jenkins kills a build due to max execution time the docker containers stay running In Progress resolved 2017-11-10 2018-07-02
179694 Create a Jenkins Job that builds the portal deployment artifacts in CI In Progress resolved 2017-11-04 2017-12-22
179694 Create a Jenkins Job that builds the portal deployment artifacts in CI In Progress resolved 2017-11-04 2017-12-22
180144 Upgrade WebdriverIO to 4.12.0 In Progress resolved 2017-11-10 2018-04-11
180144 Upgrade WebdriverIO to 4.12.0 In Progress resolved 2017-11-10 2018-04-11
180627 Support git-lfs in scap In Progress resolved 2018-03-21 2018-06-12
180627 Support git-lfs in scap In Progress resolved 2018-03-21 2018-06-12
181284 Replace nodemw with mwbot In Progress resolved 2017-11-25 2018-06-08
181284 Replace nodemw with mwbot In Progress resolved 2017-11-25 2018-06-08
182733 Address proximity of service deployments to train deployments problem In Progress resolved 2017-12-14 2018-01-31
182733 Address proximity of service deployments to train deployments problem In Progress resolved 2017-12-14 2018-01-31
183160 Sample code in Node.js for repositories that still have Selenium+Ruby tests In Progress resolved 2017-12-19 2018-06-30
183160 Sample code in Node.js for repositories that still have Selenium+Ruby tests In Progress resolved 2017-12-19 2018-06-30
183165 Verify functionality of the 'production' image in the context of an isolated k8s deployment In Progress resolved 2017-12-19 2018-08-13
183165 Verify functionality of the 'production' image in the context of an isolated k8s deployment In Progress resolved 2017-12-19 2018-08-13
183952 Investigate deployment that caused high error-rate and was prevented from going past canaries by Scap In Progress resolved 2018-01-04 2018-01-31
183952 Investigate deployment that caused high error-rate and was prevented from going past canaries by Scap In Progress resolved 2018-01-04 2018-01-31
184219 Method for running e2e/smoke tests on deployments In Progress resolved 2018-01-05 2018-03-26
184219 Method for running e2e/smoke tests on deployments In Progress resolved 2018-01-05 2018-03-26
184220 Build service-checker image for use with helm test In Progress resolved 2018-01-05 2018-03-20
184220 Build service-checker image for use with helm test In Progress resolved 2018-01-05 2018-03-20
184732 LanguageScreenshotBot uploads files to Commons without a license In Progress resolved 2018-01-12 2018-06-15
184732 LanguageScreenshotBot uploads files to Commons without a license In Progress resolved 2018-01-12 2018-06-15
185011 Create selenium-daily-beta-MediaWiki daily Jenkins job In Progress resolved 2018-01-17 2018-09-11
185011 Create selenium-daily-beta-MediaWiki daily Jenkins job In Progress resolved 2018-01-17 2018-09-11
185328 "User should be able to change preferences" Selenium test fails when targeting mediawiki-vagrant In Progress resolved 2018-01-20 2018-02-06
185328 "User should be able to change preferences" Selenium test fails when targeting mediawiki-vagrant In Progress resolved 2018-01-20 2018-02-06
185928 New usermessage browser test is blocking merges in Minerva skin and Echo extension In Progress resolved 2018-01-30 2018-02-21
185928 New usermessage browser test is blocking merges in Minerva skin and Echo extension In Progress resolved 2018-01-30 2018-02-21
185974 Create Fatal-Monitor dashboard in logstash-beta In Progress resolved 2018-08-07 2018-08-06
185974 Create Fatal-Monitor dashboard in logstash-beta In Progress resolved 2018-08-07 2018-08-06
186145 Migrate operations-mw-config-composer-hhvm-jessie to Docker In Progress resolved 2018-02-01 2018-02-16
186145 Migrate operations-mw-config-composer-hhvm-jessie to Docker In Progress resolved 2018-02-01 2018-02-16
186544 Variant expansion recursion doesn't work for multiple variants In Progress resolved 2018-02-06 2018-02-07
186544 Variant expansion recursion doesn't work for multiple variants In Progress resolved 2018-02-06 2018-02-07
186545 Blubber should support python/tox In Progress resolved 2018-02-08 2018-03-06
186545 Blubber should support python/tox In Progress resolved 2018-02-08 2018-03-06
186548 Add blubber to docker integration agents In Progress resolved 2018-02-06 2018-03-22
186548 Add blubber to docker integration agents In Progress resolved 2018-02-06 2018-03-22
186724 Trouble running selenium tests inside of mediawiki-vagrant In Progress resolved 2018-02-08 2018-02-20
186724 Trouble running selenium tests inside of mediawiki-vagrant In Progress resolved 2018-02-08 2018-02-20
187372 Blubber should implement a better file permissions convention In Progress resolved 2018-02-15 2018-03-08
187372 Blubber should implement a better file permissions convention In Progress resolved 2018-02-15 2018-03-08
187797 Migrate leftover Nodepool jobs to Docker In Progress resolved 2018-02-21 2018-03-20
187797 Migrate leftover Nodepool jobs to Docker In Progress resolved 2018-02-21 2018-03-20
188149 Phlogiston reports don't have new data since mid-February In Progress resolved 2018-02-24 2018-04-30
188149 Phlogiston reports don't have new data since mid-February In Progress resolved 2018-02-24 2018-04-30
188553 Vector browser test blocking merge in Minerva In Progress resolved 2018-03-01 2018-03-06
188553 Vector browser test blocking merge in Minerva In Progress resolved 2018-03-01 2018-03-06
188704 Create annual plan program slides In Progress resolved 2018-03-03 2018-03-20
188704 Create annual plan program slides In Progress resolved 2018-03-03 2018-03-20
188740 Retrospective for T139740 Port Selenium tests from Ruby to Node.js In Progress resolved 2018-03-03 2018-03-26
188740 Retrospective for T139740 Port Selenium tests from Ruby to Node.js In Progress resolved 2018-03-03 2018-03-26
188744 Find a few people interested in reviewing Selenium patches In Progress resolved 2018-03-03 2018-03-26
188744 Find a few people interested in reviewing Selenium patches In Progress resolved 2018-03-03 2018-03-26
188933 install kubectl on integration agents In Progress resolved 2018-03-06 2018-04-03
188933 install kubectl on integration agents In Progress resolved 2018-03-06 2018-04-03
188934 install helm on integration agents In Progress resolved 2018-03-06 2018-07-17
188934 install helm on integration agents In Progress resolved 2018-03-06 2018-07-17
188935 modify service-pipeline to include helm install/helm test In Progress resolved 2018-03-06 2018-08-13
188935 modify service-pipeline to include helm install/helm test In Progress resolved 2018-03-06 2018-08-13
189024 In Gerrit set receive.rejectImplicitMerges = True in All-Projects In Progress resolved 2018-03-07 2018-03-07
189024 In Gerrit set receive.rejectImplicitMerges = True in All-Projects In Progress resolved 2018-03-07 2018-03-07
189122 Migrate language-screenshots-VisualEditor off of Nodepool to Docker containers In Progress resolved 2018-03-08 2018-03-19
189122 Migrate language-screenshots-VisualEditor off of Nodepool to Docker containers In Progress resolved 2018-03-08 2018-03-19
189451 Jenkins fails to merge a patch with "Unexpected token function" In Progress resolved 2018-03-13 2018-03-12
189451 Jenkins fails to merge a patch with "Unexpected token function" In Progress resolved 2018-03-13 2018-03-12
189601 Setting up phabricator for the first results in schema errors In Progress resolved 2018-03-16 2018-04-24
189601 Setting up phabricator for the first results in schema errors In Progress resolved 2018-03-16 2018-04-24
190687 Pair on writing Selenium tests in JavaScript/Node.js In Progress resolved 2018-03-27 2018-05-23
190687 Pair on writing Selenium tests in JavaScript/Node.js In Progress resolved 2018-03-27 2018-05-23
190914 MediaWiki-Vagrant does not install bluebird package In Progress resolved 2018-03-29 2018-03-28
190914 MediaWiki-Vagrant does not install bluebird package In Progress resolved 2018-03-29 2018-03-28
191049 1.32.0-wmf.3 deployment blockers In Progress resolved 2018-05-08 2018-05-10
191049 1.32.0-wmf.3 deployment blockers In Progress resolved 2018-05-08 2018-05-10
191056 1.32.0-wmf.10 deployment blockers In Progress resolved 2018-06-12 2018-06-29
191056 1.32.0-wmf.10 deployment blockers In Progress resolved 2018-06-12 2018-06-29
191059 1.32.0-wmf.13 deployment blockers In Progress resolved 2018-07-06 2018-07-25
191059 1.32.0-wmf.13 deployment blockers In Progress resolved 2018-07-06 2018-07-25
191060 1.32.0-wmf.14 deployment blockers In Progress resolved 2018-07-06 2018-08-09
191060 1.32.0-wmf.14 deployment blockers In Progress resolved 2018-07-06 2018-08-09
191068 1.32.0-wmf.22 deployment blockers In Progress resolved 2018-08-31 2018-09-25
191068 1.32.0-wmf.22 deployment blockers In Progress resolved 2018-08-31 2018-09-25
191069 1.32.0-wmf.23 deployment blockers In Progress resolved 2018-09-25 2018-09-28
191069 1.32.0-wmf.23 deployment blockers In Progress resolved 2018-09-25 2018-09-28
191327 Come up with a decent method of declaring helm chart path/version in service repo In Progress resolved 2018-04-04 2018-04-27
191327 Come up with a decent method of declaring helm chart path/version in service repo In Progress resolved 2018-04-04 2018-04-27
191460 Blubber should error on unknown/obsolete config fields In Progress resolved 2018-04-05 2018-04-05
191460 Blubber should error on unknown/obsolete config fields In Progress resolved 2018-04-05 2018-04-05
191537 MediaWiki core's selenium tests flaky when run as part of mwext-mw-selenium-node-composer-jessie job In Progress resolved 2018-04-12 2018-07-18
191537 MediaWiki core's selenium tests flaky when run as part of mwext-mw-selenium-node-composer-jessie job In Progress resolved 2018-04-12 2018-07-18
191821 Host packaged helm charts at https://releases.wikimedia.org/charts In Progress resolved 2018-04-10 2018-04-12
191821 Host packaged helm charts at https://releases.wikimedia.org/charts In Progress resolved 2018-04-10 2018-04-12
192367 Failed loading configuration file ... wdio.conf.jenkins.js In Progress resolved 2018-04-19 2018-04-23
192367 Failed loading configuration file ... wdio.conf.jenkins.js In Progress resolved 2018-04-19 2018-04-23
192561 Upgrade deployment-prep deployment servers to stretch In Progress resolved 2018-04-20 2018-08-13
192561 Upgrade deployment-prep deployment servers to stretch In Progress resolved 2018-04-20 2018-08-13
193157 Quibble does not install ffmpeg In Progress resolved 2018-08-09 2018-08-28
193157 Quibble does not install ffmpeg In Progress resolved 2018-08-09 2018-08-28
193164 document quibble cache / src reuse for local installation In Progress resolved 2018-05-01 2018-07-02
193164 document quibble cache / src reuse for local installation In Progress resolved 2018-05-01 2018-07-02
193244 selenium-CirrusSearch-jessie does not run any tests In Progress resolved 2018-04-28 2018-07-13
193244 selenium-CirrusSearch-jessie does not run any tests In Progress resolved 2018-04-28 2018-07-13
194154 searching "db1055" on phabricator search doesn't find the only open task with "db1055" on the title In Progress resolved 2018-05-09 2018-07-01
194154 searching "db1055" on phabricator search doesn't find the only open task with "db1055" on the title In Progress resolved 2018-05-09 2018-07-01
194940 Wikimedia Continuous Delivery Pipeline: Say What? In Progress resolved 2018-05-19 2018-07-18
194940 Wikimedia Continuous Delivery Pipeline: Say What? In Progress resolved 2018-05-19 2018-07-18
194970 Breakout session: Quibble a test runner for MediaWiki In Progress resolved 2018-05-19 2018-07-02
194970 Breakout session: Quibble a test runner for MediaWiki In Progress resolved 2018-05-19 2018-07-02
195206 mediawiki-core-qunit-selenium-jessie tests for math broken In Progress resolved 2018-05-25 2018-07-05
195206 mediawiki-core-qunit-selenium-jessie tests for math broken In Progress resolved 2018-05-25 2018-07-05
195496 mediawiki-core-qunit-selenium-jessie sometimes fails for extensions In Progress resolved 2018-05-25 2018-07-01
195496 mediawiki-core-qunit-selenium-jessie sometimes fails for extensions In Progress resolved 2018-05-25 2018-07-01
195830 selenium-*-jessie Jenkins jobs failing with `Error: You might be using an older PHP version` In Progress resolved 2018-05-30 2018-08-23
195830 selenium-*-jessie Jenkins jobs failing with `Error: You might be using an older PHP version` In Progress resolved 2018-05-30 2018-08-23
195851 mwext-ruby-jessie fails with `Error: You might be using an older PHP version` In Progress resolved 2018-05-30 2018-07-02
195851 mwext-ruby-jessie fails with `Error: You might be using an older PHP version` In Progress resolved 2018-05-30 2018-07-02
196374 language-screenshots-VisualEditor fails with `stderr: warning: failed to remove cache` In Progress resolved 2018-06-05 2018-07-02
196374 language-screenshots-VisualEditor fails with `stderr: warning: failed to remove cache` In Progress resolved 2018-06-05 2018-07-02
196561 Document running Selenium tests targeting custom MediaWiki install In Progress resolved 2018-06-09 2018-07-01
196561 Document running Selenium tests targeting custom MediaWiki install In Progress resolved 2018-06-09 2018-07-01
196940 Establish shared library for pipeline code used in Jenkins In Progress resolved 2018-06-12 2018-09-17
196940 Establish shared library for pipeline code used in Jenkins In Progress resolved 2018-06-12 2018-09-17
197469 Migrate gated extensions jobs to Quibble/Docker In Progress resolved 2018-06-16 2018-08-01
197469 Migrate gated extensions jobs to Quibble/Docker In Progress resolved 2018-06-16 2018-08-01
197519 Some Jenkins jobs lack a timeout (ex: mediawiki-phpunit-coverage-patch) In Progress resolved 2018-06-20 2018-07-01
197519 Some Jenkins jobs lack a timeout (ex: mediawiki-phpunit-coverage-patch) In Progress resolved 2018-06-20 2018-07-01
197882 jenkins_jobs.errors.JenkinsJobsException: Duplicate entry found in '/src/integration/config/jjb/selenium.yaml: 'WikibaseLexeme' already defined In Progress resolved 2018-06-22 2018-07-02
197882 jenkins_jobs.errors.JenkinsJobsException: Duplicate entry found in '/src/integration/config/jjb/selenium.yaml: 'WikibaseLexeme' already defined In Progress resolved 2018-06-22 2018-07-02
199283 Update Debian Package for Scap3 to 3.8.4-1 In Progress resolved 2018-07-11 2018-07-11
199283 Update Debian Package for Scap3 to 3.8.4-1 In Progress resolved 2018-07-11 2018-07-11
200257 `scap sync` fails with `Error: You are missing some external dependencies.` In Progress resolved 2018-07-25 2018-07-24
200257 `scap sync` fails with `Error: You are missing some external dependencies.` In Progress resolved 2018-07-25 2018-07-24
200452 Move Blubber repo and CR to Gerrit In Progress resolved 2018-07-27 2018-08-13
200452 Move Blubber repo and CR to Gerrit In Progress resolved 2018-07-27 2018-08-13
200843 Generic CI job for running Blubber-built test entry points In Progress resolved 2018-08-02 2018-08-10
200843 Generic CI job for running Blubber-built test entry points In Progress resolved 2018-08-02 2018-08-10
200953 Jenkins fails to checkout shared Groovy library integration/pipelinelib In Progress resolved 2018-08-02 2018-08-03
200953 Jenkins fails to checkout shared Groovy library integration/pipelinelib In Progress resolved 2018-08-02 2018-08-03
201932 Wikimedia Portals Update and European Mid-day SWAT windows at the same time on Mondays In Progress resolved 2018-08-15 2018-09-05
201932 Wikimedia Portals Update and European Mid-day SWAT windows at the same time on Mondays In Progress resolved 2018-08-15 2018-09-05
202160 Evaluate different strategy for Docker CI instances In Progress resolved 2018-08-18 2018-10-01
202160 Evaluate different strategy for Docker CI instances In Progress resolved 2018-08-18 2018-10-01
203108 Create keyholder gerrit repo In Progress resolved 2018-08-30 2018-09-12
203108 Create keyholder gerrit repo In Progress resolved 2018-08-30 2018-09-12
203591 Popups daily jobs currently unusable In Progress resolved 2018-09-06 2018-09-11
203591 Popups daily jobs currently unusable In Progress resolved 2018-09-06 2018-09-11
203607 Ensure Jenkins mail configuration supports outbound smtp server failover In Progress resolved 2018-09-06 2018-09-13
203607 Ensure Jenkins mail configuration supports outbound smtp server failover In Progress resolved 2018-09-06 2018-09-13
204077 maintenance-disconnect-full-disks gets stuck In Progress resolved 2018-09-12 2018-09-21
204077 maintenance-disconnect-full-disks gets stuck In Progress resolved 2018-09-12 2018-09-21
204391 Support `KUBECONFIG` and `--tiller-namespace` for helm methods In Progress resolved 2018-09-16 2018-09-17
204391 Support `KUBECONFIG` and `--tiller-namespace` for helm methods In Progress resolved 2018-09-16 2018-09-17
204591 Blubber: put node_modules in /srv/app rather than /opt/lib In Progress resolved 2018-09-18 2018-10-02
204591 Blubber: put node_modules in /srv/app rather than /opt/lib In Progress resolved 2018-09-18 2018-10-02
205362 Migrate m4executor CI nodes to bigram instances In Progress resolved 2018-09-26 2018-09-25
205362 Migrate m4executor CI nodes to bigram instances In Progress resolved 2018-09-26 2018-09-25
137928 Deploy phabricator to phab2001.codfw.wmnet Blocked open 2017-05-17 2018-09-10
146055 Improve privilege separation for phabricator's config files and mysql credentials Blocked open 2017-03-16 2018-09-10
182085 Connect Phabricator to swift for storage of git-lfs and file uploads. Blocked open 2017-12-06 2018-09-10
182832 Apache on phab1001 is gradually leaking worker processes which are stuck in "Gracefully finishing" state Blocked open 2018-01-04 2018-09-17
193824 Determine a standard way of installing MediaWiki lib/extension dependencies within containers Blocked open 2018-05-05 2018-07-16
195244 Investigate and make improvements to the extension review process Blocked open 2018-05-22 2018-09-13
203084 Migrate DonationInterface CI job to Docker Blocked open 2018-08-30 2018-09-24
205920 Blubberoid – create swagger spec Blocked open 2018-10-02 2018-10-01
174338 Provide php-ast 0.1.5 or later as a Debian package for CI Blocked resolved 2018-02-02 2018-08-20
180524 Upgrade latest docker-registry.wikimedia.org/nodejs-devel to stretch Blocked resolved 2017-11-15 2017-12-01
183569 npm 1.4.21 can't use a http proxy Blocked resolved 2017-12-23 2018-01-12
184550 Basic plan of pre-Hackathon team offsite Blocked resolved 2018-01-10 2018-06-15
184938 Special:RecentChanges broken on Jenkins slaves Blocked resolved 2018-01-16 2018-06-19
185315 selenium-EXTENSION-jessie Jenkins job should have e-mail notification Blocked resolved 2018-01-20 2018-02-27
186786 Upload new zuul and jenkins-debian-glue packages to apt.wikimedia.org Blocked resolved 2018-02-09 2018-04-04
187850 Cleanup remaining WikipediaMobileFirefoxOS references Blocked resolved 2018-02-22 2018-07-06
187862 Update README file for Selenium tests Blocked resolved 2018-02-22 2018-06-09
188288 fr.wikipedia.beta.wmflabs.org uses an invalid security certificate Blocked resolved 2018-02-27 2018-04-13
196654 Add CI namespace in staging k8s cluster Blocked resolved 2018-06-09 2018-07-16
196702 Add thcipriani and hashar to gerrit-root Blocked resolved 2018-06-09 2018-07-01
196703 Add thcipriani to phabricator-roots Blocked resolved 2018-06-09 2018-07-02
197083 Gerrit has created duplicate accounts for some users Blocked resolved 2018-06-14 2018-08-29
94322 Re-evaluate use of "Dependent Pipeline" in Zuul for gate-and-submit Other open 2018-08-16 2018-09-10
119371 Enable MariaDB/MySQL strict mode on CI db hosts Other open 2017-01-02 2018-06-28
125618 Deprecate and remove the EducationProgram extension from Wikimedia servers after June 30, 2018 Other open 2018-07-26 2018-09-27
154915 Get rid of "import realm.pp" in manifests/site.pp Done Column open 2017-01-10 2018-05-02
159591 Castor: mediawiki-core-qunit-jessie node_modules cache ineffective Other open 2017-12-08 2017-12-07
174091 FY2017/18 Program 3 Outcome 1 Objective 2: Identify and find stewards for high-priority/high use code segment orphans Done Column open 2017-10-25 2018-06-25
175183 [Technical Debt Series]How to remove Technical Debt Other open 2017-09-07 2018-02-20
175184 [Technical Debt Series]Avoiding New Technical Debt Other open 2017-09-07 2018-06-25
177867 Pipeline image build cleanup Other open 2017-10-19 2018-08-29
178663 Switch CI Docker Storage Driver to its own partition and to use devicemapper Other open 2017-10-21 2018-08-23
179190 Run Selenium Cucumber tests in CI Other open 2017-10-28 2018-07-17
179963 Workspaces for mwgate-php55lint / mwgate-php70lint are getting huge Other open 2018-04-24 2018-09-24
181833 Figure out why HHVM kept running stale code for hours Other open 2017-12-12 2017-12-11
182160 Develop tests for phabricator search to detect regressions / search quality issues Other open 2017-12-06 2018-09-10
182759 Add Prometheus exporter to Jenkins instances Other open 2017-12-14 2018-10-01
183513 Draft requirements for a Kubernetes based solution for CI Other open 2017-12-22 2018-01-09
183999 Scap canary has a shifting baseline Other open 2018-01-03 2018-06-25
184961 Close chairwiki Other open 2018-01-17 2018-07-03
185285 Deprecate -devtools and redirect to -releng? Other open 2018-01-20 2018-08-11
186494 jenkins-debian-glue should run the lintian version from cowbuilder instead of from host Done Column open 2018-02-07 2018-04-04
186496 CI fetching tags should also create the local tag references Other open 2018-02-06 2018-02-05
187733 Running smoke tests during deployment Other open 2018-02-20 2018-07-11
188706 Setup Learning Circles for RelEng Other open 2018-03-03 2018-03-02
190073 Migrate Jenkins jobs wikimedia-portals-build and wikidata-query-gui-build to Docker and to use an entry point (eg: npm builddeploy) Other open 2018-03-20 2018-08-21
191070 1.32.0-wmf.24 deployment blockers Other open 2018-09-28 2018-09-27
191072 1.32.0-wmf.26 deployment blockers Other open 2018-09-28 2018-09-27
191373 Move Scap development to Gerrit Other open 2018-04-05 2018-08-29
192042 Create gerrit mirrors for all github-based ORES repos Other open 2018-04-13 2018-09-10
193222 Error: 1071 Specified key was too long; max key length is 767 bytes Other open 2018-04-28 2018-07-01
193533 [BetaFeatures] sql/create_counts.sql : Error: 1071 Specified key was too long; max key length is 767 bytes Other open 2018-05-02 2018-07-19
193661 Alert in -releng when permanent hosts have low disk space Other open 2018-05-03 2018-08-06
194818 Survey for Beta Cluster use cases Done Column open 2018-05-17 2018-07-02
195050 Refactor pipeline build step to be more isolated/secure/scalable Other open 2018-05-20 2018-07-23
196096 Define an approach for tracking/managing tech debt for PEP Other open 2018-06-01 2018-07-02
196347 Quibble may need to rebuild localization cache before running tests Done Column open 2018-07-20 2018-09-24
196436 EditSubpages extension fails mediawiki/core webdriver.io tests Other open 2018-06-06 2018-09-25
196515 Automate the Train Other open 2018-06-06 2018-07-03
196516 Automate updating deployment notes Other open 2018-06-06 2018-07-03
196517 Automate weekly branch cut Other open 2018-06-06 2018-07-03
197050 Figure out how RelEng can better communicate accomplishments Other open 2018-06-13 2018-07-01
197635 Developer Satisfaction Survey Other open 2018-06-19 2018-07-02
198201 Quibble must include tests/selenium/LocalSettings.php (was ORES webdriver.io selenium test fail on CI due to lack of ORES server) Other open 2018-06-27 2018-09-13
198422 Running scap sync-dir php-1.32.0-wmf.10 fails due to syntax error Done Column open 2018-06-29 2018-07-17
198517 Quibble docker instance running on CI instance for 6 hours Other open 2018-06-30 2018-09-14
199116 Quibble should run `npm install` and `npm run selenium-test` for each extension/skin that has Selenium tests Other open 2018-07-10 2018-09-25
199207 404 on workboard for an existing project (due to custom filter applied which did not exist in database) Other open 2018-07-11 2018-10-01
199253 TEC13:O1.1:Q1 Goal - Investigate and propose record of origin (ROO) for deployed code (currently Developers/Maintainers page) Other open 2018-07-11 2018-09-06
199388 When scap deploy is aborted it should say so in the log Other open 2018-07-13 2018-07-17
201875 Allow new blubber builders to be implemented in yaml Other open 2018-08-14 2018-08-13
202080 Publish the source for phabricator-antivandalism Other open 2018-08-17 2018-09-10
203091 Move Graphoid to Kubernetes via the deployment pipeline Other open 2018-08-30 2018-10-01
203092 Create Graphoid .pipeline files Other open 2018-08-30 2018-08-29
203278 Archive Mathoid deploy repo Other open 2018-09-01 2018-09-21
203698 Add Code Stewardship review Other open 2018-09-07 2018-09-13
203701 Add Services (and other non-extensions) to the deployment review process Other open 2018-09-07 2018-09-13
204160 Should security tasks be a custom type in maniphest? Other open 2018-09-13 2018-10-01
204252 Have dependencies of gated extensions in the gate Other open 2018-09-14 2018-09-13
204383 Update Debian Package for Scap to 3.8.6-1 Other open 2018-09-15 2018-09-14
204762 On deployment-prep scap cache_git_info takes 12 minutes (that is too slow) Other open 2018-09-19 2018-09-25
205002 scap clean not cleaning up deployment host fully Other open 2018-09-25 2018-09-24
115436 ResourcesTest::testFileExistence does not ignore anchor in url Other resolved 2018-07-18 2018-07-20
127271 Phabricator errors when filing new Maniphest task (due to "Can Edit Task Policies" policy for application Maniphest) Other resolved 2018-01-02 2018-06-18
127903 Projects should have an "Open Tasks" view by default Other resolved 2018-08-09 2018-08-08
146285 Switch mwscript from Zend PHP5 to default php alternative (e.g. HHVM or PHP7) Other resolved 2017-01-02 2018-07-06
148478 Investigate seemingly random Gerrit slow-downs Other resolved 2017-01-02 2018-01-29
152640 Cannot log into Gerrit as of recent upgrade Other resolved 2017-06-08 2018-06-14
157030 cannot delete non-empty directory: php-1.29.0-wmf.3 messages on 'scap sync' on mwdebug1002 Other resolved 2017-02-03 2018-09-24
164030 setup releases1001.eqiad.wmnet (was: setup mwreleases1001) Other resolved 2017-04-28 2017-10-13
164470 Patch for 1.27.3/1.28.2 missing Other resolved 2018-01-30 2018-01-31
166672 Move PropertySuggester-Python to gerrit Other resolved 2018-01-17 2018-01-16
169352 Phabricator "Duplicate entry" error when moving tasks between workboard columns Other resolved 2017-07-01 2018-07-04
173349 Identify Orphaned components/code Done Column resolved 2017-08-15 2018-01-22
174096 FY2017/18 Program 3 Outcome 2 Objective 3: Promote and surface important technical debt topics at large gatherings of Wikimedia developers (e.g., DevSummit and Hackathon(s)) Done Column resolved 2017-10-25 2018-05-31
174103 [Epic] Port Selenium tests from Ruby to Node.js for the Search Platform Done Column resolved 2017-09-29 2017-12-15
174631 Support for Blubber defaults and/or policies Other resolved 2017-08-31 2018-04-02
175181 [Technical Debt Series]What is Technical Debt Done Column resolved 2017-09-07 2018-04-23
177272 Make it easier to identify dependent images that need rebuilding when a base docker image changes Other resolved 2017-10-04 2017-10-07
177276 Unify production and CI docker image build process Other resolved 2017-10-05 2018-01-12
177499 On CI, upgrade docker-ce from 17.06.2 to 17.12.1 Other resolved 2017-10-24 2018-03-02
178226 Rename mediawiki/extensions/WikibaseJavaScriptApi repo Other resolved 2017-11-03 2018-08-30
178454 Icinga disk space alert when a Docker container is running on an host Other resolved 2017-10-19 2017-12-14
178457 nutcracker fails to start due to lack of /var/run/nutcracker (ex: deployment-videoscaler01 has memcached failures) Other resolved 2017-10-19 2018-04-18
179772 Install zip extension for CI Other resolved 2017-11-08 2018-04-13
180035 MediaWiki core Selenium tests fail when targeting Vagrant Done Column resolved 2017-11-09 2018-01-22
180401 Create a dedicated deployment window for portal deployments Other resolved 2017-11-16 2017-11-28
180625 Create "what we need" doc Other resolved 2017-11-16 2018-02-24
180749 1.31.0-wmf.16 deployment blockers Done Column resolved 2018-01-10 2018-01-22
180933 qa-alerts admin password recovery Other resolved 2017-11-21 2017-11-20
181037 cxserver deployment on beta is broken Other resolved 2017-11-22 2017-12-18
181384 Icinga "configured eth" warning when a Docker container is running Other resolved 2017-11-28 2017-11-27
181799 Update Portals page on Beta to reflect head of master branch Done Column resolved 2018-01-04 2018-01-05
181938 Swap node for jq in mw-fetch-composer-dev.sh Other resolved 2018-01-04 2018-02-20
182336 mediawiki/core tests failing for REL1_30 due to Wikibase Other resolved 2017-12-08 2017-12-10
182635 Explain to TechComm (Daniel K) part of learnings from ORES post-mortem re arch reviews Other resolved 2017-12-12 2018-07-05
182860 Allow contint-admins to interact with docker on CI hosts Other resolved 2017-12-15 2017-12-19
183427 End of Q2 grooming Other resolved 2017-12-21 2018-01-02
183956 1.31.0-wmf.17 deployment blockers Done Column resolved 2018-01-18 2018-01-23
183959 1.31.0-wmf.20 deployment blockers Other resolved 2018-01-24 2018-02-21
183960 1.31.0-wmf.21 deployment blockers Other resolved 2018-01-24 2018-02-20
183961 1.31.0-wmf.22 deployment blockers Other resolved 2018-02-09 2018-03-01
183962 1.31.0-wmf.23 deployment blockers Other resolved 2018-02-23 2018-03-07
183963 1.31.0-wmf.24 deployment blockers Other resolved 2018-02-23 2018-03-28
183964 1.31.0-wmf.25 deployment blockers Other resolved 2018-03-02 2018-03-19
183965 1.31.0-wmf.26 deployment blockers Other resolved 2018-03-02 2018-03-26
183966 1.31.0-wmf.27 deployment blockers Other resolved 2018-03-29 2018-04-02
183967 1.31.0-wmf.28 deployment blockers Other resolved 2018-03-29 2018-04-06
183968 1.31.0-wmf.29 deployment blockers Other resolved 2018-03-30 2018-04-17
183969 1.31.0-wmf.30 deployment blockers Done Column resolved 2018-03-30 2018-04-24
184176 Scap not working in Beta Other resolved 2018-01-05 2018-01-10
184224 Package/upload service-checker for Debian stretch Other resolved 2018-01-06 2018-02-01
184457 Installation method for Minikube on CI for k8s testing Other resolved 2018-01-09 2018-06-15
184459 Test phabricator translations on phab.wmflabs.org Other resolved 2018-01-09 2018-06-15
184754 many search-mjolnir-tox-docker jobs in aborted state Other resolved 2018-01-12 2018-06-15
184781 Docker won't start on integration-slave-docker-1005 Other resolved 2018-01-13 2018-06-15
184882 Scap: TypeError: error: (not all arguments converted during string formatting); format string: (Passed unrecognized git_binary_manager {}); arguments: ((u'fat',)) Other resolved 2018-01-15 2018-07-11
185931 npm-node-6-docker tests failing for Android project (test fallback to broken npm 1.4.21 instead of 3.8.3) Done Column resolved 2018-01-30 2018-02-06
185970 wikibugs IRC bot can see private commits in Gerrit? Other resolved 2018-03-01 2018-02-28
186381 Exception while launching job: TypeError: 'int' object has no attribute '__getitem__' Done Column resolved 2018-02-07 2018-06-11
186532 2018-02-05 MCS Beta Cluster deployment failed with error Other resolved 2018-02-06 2018-02-05
186949 Zuul no longer starts gate-and-submit when parent is in gate-and-submit pipeline Done Column resolved 2018-02-17 2018-03-26
187195 beta cluster scap errors Other resolved 2018-02-14 2018-02-13
187269 Unable to log in on Gerrit Other resolved 2018-02-14 2018-02-14
187567 CI is running against parent patches, not the patches themselves for chained patches Done Column resolved 2018-02-17 2018-03-26
187761 Proposal: Effective immediately, disallow multi-sync patch deployment Done Column resolved 2018-02-21 2018-05-04
187790 Phabricator: Clean up deadlocked apache processes Other resolved 2018-02-21 2018-02-21
187815 RESTBase deployment fails in beta cluster Other resolved 2018-02-21 2018-02-20
187891 Beta cluster api.php never responds Other resolved 2018-02-22 2018-02-21
188080 releases1001 has full / partition Other resolved 2018-02-24 2018-07-13
188285 Running mvn on wikidata/query/rdf fails with: /bin/sh: 1: npm: not found Other resolved 2018-02-27 2018-02-26
188290 User commenting on a merge change that it had Cr+2 cause it to enter gate-and-submit again Other resolved 2018-03-16 2018-03-16
188520 Use a more complex password for WikiAdmin in selenium tests Other resolved 2018-03-02 2018-09-18
189062 Follow up with platform team regarding refactoring plans Other resolved 2018-03-07 2018-07-10
189365 integration-slave-jessie-XXXX is out of disk space Other resolved 2018-03-11 2018-03-20
189660 phabricator-jessie-diffs fails with "echo : No such file or directory" Other resolved 2018-03-15 2018-03-22
189693 mediawiki-core-code-coverage & mediawiki-core-code-coverage-php7 jobs lock up labs integration slaves Other resolved 2018-03-15 2018-07-17
189811 Set up user for automatic WDQS GUI builds Done Column resolved 2018-03-16 2018-05-07
189859 Zuul coverage pipeline is no more processing mwext-phpunit-coverage-patch jobs Other resolved 2018-03-17 2018-03-16
190032 Migrate CI job search-xgboost-maven to use a Docker container Other resolved 2018-03-20 2018-03-19
190039 CirrusSearch smoke selenium tests cause failures of mediawiki-core-qunit-selenium-jessie job for extensions Done Column resolved 2018-03-21 2018-04-05
190042 Migrate CI job wikidata-query-rdf-maven-site-publish to use a Docker container Other resolved 2018-03-20 2018-03-19
190046 Write Selenium tests in JavaScript/Node.js workshop Other resolved 2018-03-20 2018-05-20
190269 Warning: Task "stylelint:src" failed due to postcss-less@1.1.4 Done Column resolved 2018-03-22 2018-04-13
190598 Please create a phame blog for surveys and other type of aggregated analysis Done Column resolved 2018-03-25 2018-03-26
190810 Install motd plugin Other resolved 2018-03-28 2018-04-03
190879 Prepare CI for REL1_31 Other resolved 2018-03-28 2018-04-18
191047 1.32.0-wmf.1 deployment blockers Other resolved 2018-04-25 2018-05-02
191048 1.32.0-wmf.2 deployment blockers Other resolved 2018-04-25 2018-05-07
191050 1.32.0-wmf.4 deployment blockers Other resolved 2018-05-08 2018-05-22
191051 1.32.0-wmf.5 deployment blockers Other resolved 2018-05-08 2018-05-31
191052 1.32.0-wmf.6 deployment blockers Other resolved 2018-05-08 2018-06-05
191053 1.32.0-wmf.7 deployment blockers Other resolved 2018-05-08 2018-06-13
191054 1.32.0-wmf.8 deployment blockers Done Column resolved 2018-05-08 2018-06-18
191058 1.32.0-wmf.12 deployment blockers Done Column resolved 2018-07-06 2018-07-13
191061 1.32.0-wmf.15 deployment blockers Other resolved 2018-07-06 2018-08-03
191062 1.32.0-wmf.16 deployment blockers Other resolved 2018-08-03 2018-08-09
191064 1.32.0-wmf.18 deployment blockers Other resolved 2018-08-04 2018-08-27
191065 1.32.0-wmf.19 deployment blockers Other resolved 2018-08-29 2018-09-04
191066 1.32.0-wmf.20 deployment blockers Other resolved 2018-08-31 2018-09-11
191077 zuul merge cloner might be broken Other resolved 2018-03-31 2018-03-30
191088 Release MW 1.31 Other resolved 2018-03-30 2018-06-13
191090 Run maintenance/updateCredits.php on master branch and upload changes to CREDITS for review. Other resolved 2018-03-30 2018-04-18
191233 Add missing dependencies for MediaWiki tests to quibble image Other resolved 2018-04-04 2018-04-03
191462 Git commit is missing from compiled Blubber version when packaged for Debian Other resolved 2018-04-05 2018-04-04
191865 Deploy "Deadlines" feature Other resolved 2018-04-11 2018-08-20
191921 mwscript rebuildLocalisationCache.php takes 40 minutes on HHVM (rather than ~5 on PHP 5) Other resolved 2018-04-11 2018-09-24
192124 Deploy Scap 3.8.0 to production Other resolved 2018-04-14 2018-04-20
192849 beta-scap-equiad failure: Error writing to CDB file Other resolved 2018-04-24 2018-07-02
192935 Create q3 quarterly check in slides Done Column resolved 2018-04-25 2018-05-02
193057 `quibble` fails with git 2.15: Type of packed-Refs not understood: '# pack-refs with: peeled fully-peeled sorted' Other resolved 2018-04-27 2018-07-01
193131 Quibble can not find NPM Other resolved 2018-07-03 2018-07-02
193202 Request access for deployment-prep Other resolved 2018-04-27 2018-07-01
193402 'resources/screen.less : Stylesheets should not both specify "media" and contain @media Other resolved 2018-07-11 2018-07-10
193403 truglass/handheld.css : Stylesheets should not both specify "media" and contain @media Other resolved 2018-07-11 2018-07-10
193404 [mediawiki/skins/Tempo] resources/tempo.css : Stylesheets should not both specify "media" and contain @media Other resolved 2018-07-11 2018-07-10
193502 Write JD for DevProd position Done Column resolved 2018-05-02 2018-07-02
193767 Scribunto: Scribunto_LuaStandaloneInterpreterTest::testGetStatus Initial vsize Failed asserting that 0 is greater than 0 Other resolved 2018-05-04 2018-07-01
193883 `FATAL: java.io.IOException: java.nio.file.NoSuchFileException: ...build/screenshots.yml` for language-screenshots-VisualEditor Other resolved 2018-05-05 2018-07-02
193906 debian-glue errors out with: hooks/B90lintian: line 21: realpath: command not found Other resolved 2018-07-03 2018-07-02
194280 `npm audit` for mediawiki/core found 24 vulnerabilities Done Column resolved 2018-05-11 2018-09-10
194308 Transaction should be in the callback stage (not 'cursory') Other resolved 2018-07-03 2018-07-02
194773 Repository Ownership Request for user Zoranzoki21 for extension PushToWatch Other resolved 2018-07-03 2018-07-02
194934 Technical Debt Done Column resolved 2018-05-19 2018-07-02
194937 Quality Assurance SIG (special interest group) meetup Done Column resolved 2018-05-19 2018-07-02
195634 quibble: with hhvm, "could not load extension asset expand.svg" due to lack of proper Content-Type header Other resolved 2018-05-26 2018-07-02
195783 [PropertySuggester] MWException from line 167 of /workspace/src/includes/Hooks.php: Invalid callback PropertySuggester\Hooks::onCreateSchema in hooks for LoadExtensionSchemaUpdates Other resolved 2018-07-03 2018-07-02
195831 [AkismetKlik] MWException Set $wgAKkey in LocalSettings.php or relevant configuration file. Other resolved 2018-07-03 2018-07-02
195864 Node.js Selenium framework lacks documentation Other resolved 2018-07-03 2018-07-02
195918 Move MediaWiki extension PHPUnit coverage jobs to docker + quibble Other resolved 2018-07-28 2018-09-24
196013 Get Wikibase + dependencies to run with Quibble Other resolved 2018-06-09 2018-09-24
196037 Add Backport Repository to Jenkins Package Build Other resolved 2018-06-09 2018-07-02
196062 EXT_DEPENDENCIES no more being injected on quibble jobs Other resolved 2018-07-02 2018-07-05
196431 [EditNotify] Invalid argument supplied for foreach() in extensions/EditNotify/EditNotify.hooks.php on line 917 Other resolved 2018-07-06 2018-07-05
196451 Add Candalua to the CI user whitelist Other resolved 2018-07-02 2018-07-01
196454 Is there a way to specify different different inter-extension-dependencies for REL-Branches? Other resolved 2018-07-02 2018-07-01
196510 [SocialLogin] $wgSocialLoginServices has no default triggering notice/warning Other resolved 2018-07-02 2018-07-01
196532 [Reflect] PHP Fatal error: Uncaught Error: Class 'LqtDispatch' not found in extensions/Reflect/server/classes/Dispatch.php:53 Other resolved 2018-07-03 2018-07-02
196565 Phabricator is very slow to load Other resolved 2018-06-09 2018-07-02
196567 [ReadingLists] No registered builder available for ReadingLists. Done Column resolved 2018-07-21 2018-09-04
196800 Change rebase causes a Missing blob e959c00909e3b4ae11c26a58616a2d699883dcf3 Other resolved 2018-06-10 2018-07-02
196869 In Gerrit some users are reporting problems saving there preferences Other resolved 2018-06-12 2018-07-02
197204 Maintainer access for Wikimedia Commons Android Tools project Other resolved 2018-07-03 2018-07-02
197207 integration cumin can't ssh to instances: Connection closed by integration-cumin [preauth] Other resolved 2018-06-15 2018-07-03
197806 jsduck not found Other resolved 2018-06-21 2018-07-02
197933 CI no more inject extensions dependencies on REL branches Other resolved 2018-07-04 2018-07-03
198120 [TrustedXFF] on fresh install trusted-xff.cdb is missing and User::getDefaultOptions() cause a fatal Done Column resolved 2018-07-10 2018-08-29
198124 wdio: Cannot find module 'wdio-mediawiki/Util' from specs/page.js:8:9 Other resolved 2018-07-03 2018-07-02
198185 Scap sync --restart not working Other resolved 2018-06-27 2018-06-27
198229 [Graph] extension fails QUnit tests due to timeout Other resolved 2018-06-27 2018-07-05
198331 [Cognate] install fails with BadMethodCallException from line 83 of includes/libs/rdbms/lbfactory/LBFactorySingle.php: Method is not supported. Done Column resolved 2018-07-21 2018-08-21
198336 OpenStackManager tests fail on Quibble container: Error: Call to undefined function ldap_bind() Other resolved 2018-06-28 2018-07-08
198348 Quibble CI jobs time out after 30min due to instance stalling at "npm install parse" step Other resolved 2018-07-20 2018-07-27
198384 UploadWizard: Selenium tests failing Other resolved 2018-06-29 2018-07-02
198621 Scap3 doesn't support non us-ascii characters in config templates for service deployments Other resolved 2018-07-03 2018-07-11
198640 Perform scap canary checks after sync-wikiversions Other resolved 2018-07-03 2018-09-04
198973 Wikibase tests are failing CI on unrelated changes Other resolved 2018-07-07 2018-07-09
199047 Add "gmp" php extension to Quibble images Other resolved 2018-07-09 2018-07-09
199080 FormatJson should not be used in upper case form FormatJSON Other resolved 2018-07-10 2018-07-09
199460 Update gerrit to 2.15.3 Other resolved 2018-07-13 2018-07-27
199489 Helm test failing for CI namespace Other resolved 2018-07-13 2018-08-03
199592 releng.team should use HTTPS Other resolved 2018-07-15 2018-08-31
199742 TEC3:O1.1:Q1 Goal - Move verify stage from Minikube to CI k8s namespace in production context Other resolved 2018-07-17 2018-10-01
199746 Cleanup minikube instance from integration Other resolved 2018-07-17 2018-08-17
200017 Quibble should be able to be forced to run extensions testsuite when triggered from mediawiki/core Other resolved 2018-07-20 2018-09-24
200026 RepoGroup exceptions due to "false" being passed as a key to MapCacheLRU Other resolved 2018-07-20 2018-07-20
200063 [intersection] parser tests fail and CI ignore tests Other resolved 2018-07-21 2018-07-20
200669 Help needed to setup the elastic6 dev branch on CirrusSearch, Elastica and mediawiki-vendor Other resolved 2018-07-31 2018-07-31
201224 Jenkins should auto-depool nodes if they run out of disk space on specific partitions Other resolved 2018-08-22 2018-08-31
201306 Revoke the volunteer badge from my account Other resolved 2018-08-07 2018-08-06
201460 Unable to log in to Phabricator via MediaWiki on mobile (CSP error) Other resolved 2018-08-10 2018-08-24
201972 Add some more m4executor docker slaves for Jenkins Other resolved 2018-08-15 2018-09-20
202068 Move path for blubber.yaml to ./.pipeline/blubber.yaml for all blubber jobs Other resolved 2018-08-17 2018-08-27
202222 Phabricator DB query request: list repositories and assigned callsigns Other resolved 2018-08-21 2018-08-28
202412 [BlueSpiceAvatars] PHP Notice BS_DATA_DIR / BS_DATA_PATH Other resolved 2018-08-25 2018-09-19
202457 mediawiki-quibble docker jobs fails due to disk full Other resolved 2018-08-22 2018-10-01
202483 www.mediawiki.org showing: error:Unknown database 'wikidatawiki' on shard: s3 Other resolved 2018-08-23 2018-08-22
202523 Migrate parsoidsvc-hhvm-parsertests-jessie off of Nodepool Other resolved 2018-08-23 2018-08-22
202710 Xvfb causes _XSERVTransmkdir: ERROR: euid != 0,directory /tmp/.X11-unix will not be created Other resolved 2018-08-25 2018-09-24
203093 Add service-pipeline to zuul for Graphoid Other resolved 2018-08-30 2018-08-29
203178 Migrate Selenium tests based on the ruby library mediawiki_selenium Other resolved 2018-08-31 2018-09-24
203271 Update Debian Package for Scap to 3.8.5-1 Other resolved 2018-09-01 2018-09-04
203841 Provide dedicated storage space to Docker for images/containers Other resolved 2018-09-08 2018-09-13
203902 Rebuild quibble images for Chrome 69 and Firefox 60 Other resolved 2018-09-13 2018-09-13
204214 mwselenium-quibble-docker jobs broken on WikibaseLexeme Other resolved 2018-09-14 2018-09-17
204710 make-wmf-branch: no permission on lib/ve VisualEditor submodule Other resolved 2018-09-19 2018-09-18
204757 [OAuth] PHP Fatal Error: Call to undefined method MediaWiki\Extensions\OAuth\MWOAuthDAOAccessControl::getForHtml() Other resolved 2018-09-19 2018-09-18
94322 Re-evaluate use of "Dependent Pipeline" in Zuul for gate-and-submit Other open 2018-08-16 2018-09-10
119371 Enable MariaDB/MySQL strict mode on CI db hosts Other open 2017-01-02 2018-06-28
125618 Deprecate and remove the EducationProgram extension from Wikimedia servers after June 30, 2018 Other open 2018-07-26 2018-09-27
159591 Castor: mediawiki-core-qunit-jessie node_modules cache ineffective Other open 2017-12-08 2017-12-07
175183 [Technical Debt Series]How to remove Technical Debt Other open 2017-09-07 2018-02-20
175184 [Technical Debt Series]Avoiding New Technical Debt Other open 2017-09-07 2018-06-25
177867 Pipeline image build cleanup Other open 2017-10-19 2018-08-29
178663 Switch CI Docker Storage Driver to its own partition and to use devicemapper Other open 2017-10-21 2018-08-23
179190 Run Selenium Cucumber tests in CI Other open 2017-10-28 2018-07-17
179963 Workspaces for mwgate-php55lint / mwgate-php70lint are getting huge Other open 2018-04-24 2018-09-24
181833 Figure out why HHVM kept running stale code for hours Other open 2017-12-12 2017-12-11
182160 Develop tests for phabricator search to detect regressions / search quality issues Other open 2017-12-06 2018-09-10
182759 Add Prometheus exporter to Jenkins instances Other open 2017-12-14 2018-10-01
183513 Draft requirements for a Kubernetes based solution for CI Other open 2017-12-22 2018-01-09
183999 Scap canary has a shifting baseline Other open 2018-01-03 2018-06-25
184961 Close chairwiki Other open 2018-01-17 2018-07-03
185285 Deprecate -devtools and redirect to -releng? Other open 2018-01-20 2018-08-11
186496 CI fetching tags should also create the local tag references Other open 2018-02-06 2018-02-05
187733 Running smoke tests during deployment Other open 2018-02-20 2018-07-11
188706 Setup Learning Circles for RelEng Other open 2018-03-03 2018-03-02
190073 Migrate Jenkins jobs wikimedia-portals-build and wikidata-query-gui-build to Docker and to use an entry point (eg: npm builddeploy) Other open 2018-03-20 2018-08-21
191070 1.32.0-wmf.24 deployment blockers Other open 2018-09-28 2018-09-27
191072 1.32.0-wmf.26 deployment blockers Other open 2018-09-28 2018-09-27
191373 Move Scap development to Gerrit Other open 2018-04-05 2018-08-29
192042 Create gerrit mirrors for all github-based ORES repos Other open 2018-04-13 2018-09-10
193222 Error: 1071 Specified key was too long; max key length is 767 bytes Other open 2018-04-28 2018-07-01
193533 [BetaFeatures] sql/create_counts.sql : Error: 1071 Specified key was too long; max key length is 767 bytes Other open 2018-05-02 2018-07-19
193661 Alert in -releng when permanent hosts have low disk space Other open 2018-05-03 2018-08-06
195050 Refactor pipeline build step to be more isolated/secure/scalable Other open 2018-05-20 2018-07-23
196096 Define an approach for tracking/managing tech debt for PEP Other open 2018-06-01 2018-07-02
196436 EditSubpages extension fails mediawiki/core webdriver.io tests Other open 2018-06-06 2018-09-25
196515 Automate the Train Other open 2018-06-06 2018-07-03
196516 Automate updating deployment notes Other open 2018-06-06 2018-07-03
196517 Automate weekly branch cut Other open 2018-06-06 2018-07-03
197050 Figure out how RelEng can better communicate accomplishments Other open 2018-06-13 2018-07-01
197635 Developer Satisfaction Survey Other open 2018-06-19 2018-07-02
198201 Quibble must include tests/selenium/LocalSettings.php (was ORES webdriver.io selenium test fail on CI due to lack of ORES server) Other open 2018-06-27 2018-09-13
198517 Quibble docker instance running on CI instance for 6 hours Other open 2018-06-30 2018-09-14
199116 Quibble should run `npm install` and `npm run selenium-test` for each extension/skin that has Selenium tests Other open 2018-07-10 2018-09-25
199207 404 on workboard for an existing project (due to custom filter applied which did not exist in database) Other open 2018-07-11 2018-10-01
199253 TEC13:O1.1:Q1 Goal - Investigate and propose record of origin (ROO) for deployed code (currently Developers/Maintainers page) Other open 2018-07-11 2018-09-06
199388 When scap deploy is aborted it should say so in the log Other open 2018-07-13 2018-07-17
201875 Allow new blubber builders to be implemented in yaml Other open 2018-08-14 2018-08-13
202080 Publish the source for phabricator-antivandalism Other open 2018-08-17 2018-09-10
203091 Move Graphoid to Kubernetes via the deployment pipeline Other open 2018-08-30 2018-10-01
203092 Create Graphoid .pipeline files Other open 2018-08-30 2018-08-29
203278 Archive Mathoid deploy repo Other open 2018-09-01 2018-09-21
203698 Add Code Stewardship review Other open 2018-09-07 2018-09-13
203701 Add Services (and other non-extensions) to the deployment review process Other open 2018-09-07 2018-09-13
204160 Should security tasks be a custom type in maniphest? Other open 2018-09-13 2018-10-01
204252 Have dependencies of gated extensions in the gate Other open 2018-09-14 2018-09-13
204383 Update Debian Package for Scap to 3.8.6-1 Other open 2018-09-15 2018-09-14
204762 On deployment-prep scap cache_git_info takes 12 minutes (that is too slow) Other open 2018-09-19 2018-09-25
205002 scap clean not cleaning up deployment host fully Other open 2018-09-25 2018-09-24
115436 ResourcesTest::testFileExistence does not ignore anchor in url Other resolved 2018-07-18 2018-07-20
127271 Phabricator errors when filing new Maniphest task (due to "Can Edit Task Policies" policy for application Maniphest) Other resolved 2018-01-02 2018-06-18
127903 Projects should have an "Open Tasks" view by default Other resolved 2018-08-09 2018-08-08
146285 Switch mwscript from Zend PHP5 to default php alternative (e.g. HHVM or PHP7) Other resolved 2017-01-02 2018-07-06
148478 Investigate seemingly random Gerrit slow-downs Other resolved 2017-01-02 2018-01-29
152640 Cannot log into Gerrit as of recent upgrade Other resolved 2017-06-08 2018-06-14
157030 cannot delete non-empty directory: php-1.29.0-wmf.3 messages on 'scap sync' on mwdebug1002 Other resolved 2017-02-03 2018-09-24
164030 setup releases1001.eqiad.wmnet (was: setup mwreleases1001) Other resolved 2017-04-28 2017-10-13
164470 Patch for 1.27.3/1.28.2 missing Other resolved 2018-01-30 2018-01-31
166672 Move PropertySuggester-Python to gerrit Other resolved 2018-01-17 2018-01-16
169352 Phabricator "Duplicate entry" error when moving tasks between workboard columns Other resolved 2017-07-01 2018-07-04
174631 Support for Blubber defaults and/or policies Other resolved 2017-08-31 2018-04-02
177272 Make it easier to identify dependent images that need rebuilding when a base docker image changes Other resolved 2017-10-04 2017-10-07
177276 Unify production and CI docker image build process Other resolved 2017-10-05 2018-01-12
177499 On CI, upgrade docker-ce from 17.06.2 to 17.12.1 Other resolved 2017-10-24 2018-03-02
178226 Rename mediawiki/extensions/WikibaseJavaScriptApi repo Other resolved 2017-11-03 2018-08-30
178454 Icinga disk space alert when a Docker container is running on an host Other resolved 2017-10-19 2017-12-14
178457 nutcracker fails to start due to lack of /var/run/nutcracker (ex: deployment-videoscaler01 has memcached failures) Other resolved 2017-10-19 2018-04-18
179772 Install zip extension for CI Other resolved 2017-11-08 2018-04-13
180401 Create a dedicated deployment window for portal deployments Other resolved 2017-11-16 2017-11-28
180625 Create "what we need" doc Other resolved 2017-11-16 2018-02-24
180933 qa-alerts admin password recovery Other resolved 2017-11-21 2017-11-20
181037 cxserver deployment on beta is broken Other resolved 2017-11-22 2017-12-18
181384 Icinga "configured eth" warning when a Docker container is running Other resolved 2017-11-28 2017-11-27
181938 Swap node for jq in mw-fetch-composer-dev.sh Other resolved 2018-01-04 2018-02-20
182336 mediawiki/core tests failing for REL1_30 due to Wikibase Other resolved 2017-12-08 2017-12-10
182635 Explain to TechComm (Daniel K) part of learnings from ORES post-mortem re arch reviews Other resolved 2017-12-12 2018-07-05
182860 Allow contint-admins to interact with docker on CI hosts Other resolved 2017-12-15 2017-12-19
183427 End of Q2 grooming Other resolved 2017-12-21 2018-01-02
183959 1.31.0-wmf.20 deployment blockers Other resolved 2018-01-24 2018-02-21
183960 1.31.0-wmf.21 deployment blockers Other resolved 2018-01-24 2018-02-20
183961 1.31.0-wmf.22 deployment blockers Other resolved 2018-02-09 2018-03-01
183962 1.31.0-wmf.23 deployment blockers Other resolved 2018-02-23 2018-03-07
183963 1.31.0-wmf.24 deployment blockers Other resolved 2018-02-23 2018-03-28
183964 1.31.0-wmf.25 deployment blockers Other resolved 2018-03-02 2018-03-19
183965 1.31.0-wmf.26 deployment blockers Other resolved 2018-03-02 2018-03-26
183966 1.31.0-wmf.27 deployment blockers Other resolved 2018-03-29 2018-04-02
183967 1.31.0-wmf.28 deployment blockers Other resolved 2018-03-29 2018-04-06
183968 1.31.0-wmf.29 deployment blockers Other resolved 2018-03-30 2018-04-17
184176 Scap not working in Beta Other resolved 2018-01-05 2018-01-10
184224 Package/upload service-checker for Debian stretch Other resolved 2018-01-06 2018-02-01
184457 Installation method for Minikube on CI for k8s testing Other resolved 2018-01-09 2018-06-15
184459 Test phabricator translations on phab.wmflabs.org Other resolved 2018-01-09 2018-06-15
184754 many search-mjolnir-tox-docker jobs in aborted state Other resolved 2018-01-12 2018-06-15
184781 Docker won't start on integration-slave-docker-1005 Other resolved 2018-01-13 2018-06-15
184882 Scap: TypeError: error: (not all arguments converted during string formatting); format string: (Passed unrecognized git_binary_manager {}); arguments: ((u'fat',)) Other resolved 2018-01-15 2018-07-11
185970 wikibugs IRC bot can see private commits in Gerrit? Other resolved 2018-03-01 2018-02-28
186532 2018-02-05 MCS Beta Cluster deployment failed with error Other resolved 2018-02-06 2018-02-05
187195 beta cluster scap errors Other resolved 2018-02-14 2018-02-13
187269 Unable to log in on Gerrit Other resolved 2018-02-14 2018-02-14
187790 Phabricator: Clean up deadlocked apache processes Other resolved 2018-02-21 2018-02-21
187815 RESTBase deployment fails in beta cluster Other resolved 2018-02-21 2018-02-20
187891 Beta cluster api.php never responds Other resolved 2018-02-22 2018-02-21
188080 releases1001 has full / partition Other resolved 2018-02-24 2018-07-13
188285 Running mvn on wikidata/query/rdf fails with: /bin/sh: 1: npm: not found Other resolved 2018-02-27 2018-02-26
188290 User commenting on a merge change that it had Cr+2 cause it to enter gate-and-submit again Other resolved 2018-03-16 2018-03-16
188520 Use a more complex password for WikiAdmin in selenium tests Other resolved 2018-03-02 2018-09-18
189062 Follow up with platform team regarding refactoring plans Other resolved 2018-03-07 2018-07-10
189365 integration-slave-jessie-XXXX is out of disk space Other resolved 2018-03-11 2018-03-20
189660 phabricator-jessie-diffs fails with "echo : No such file or directory" Other resolved 2018-03-15 2018-03-22
189693 mediawiki-core-code-coverage & mediawiki-core-code-coverage-php7 jobs lock up labs integration slaves Other resolved 2018-03-15 2018-07-17
189859 Zuul coverage pipeline is no more processing mwext-phpunit-coverage-patch jobs Other resolved 2018-03-17 2018-03-16
190032 Migrate CI job search-xgboost-maven to use a Docker container Other resolved 2018-03-20 2018-03-19
190042 Migrate CI job wikidata-query-rdf-maven-site-publish to use a Docker container Other resolved 2018-03-20 2018-03-19
190046 Write Selenium tests in JavaScript/Node.js workshop Other resolved 2018-03-20 2018-05-20
190810 Install motd plugin Other resolved 2018-03-28 2018-04-03
190879 Prepare CI for REL1_31 Other resolved 2018-03-28 2018-04-18
191047 1.32.0-wmf.1 deployment blockers Other resolved 2018-04-25 2018-05-02
191048 1.32.0-wmf.2 deployment blockers Other resolved 2018-04-25 2018-05-07
191050 1.32.0-wmf.4 deployment blockers Other resolved 2018-05-08 2018-05-22
191051 1.32.0-wmf.5 deployment blockers Other resolved 2018-05-08 2018-05-31
191052 1.32.0-wmf.6 deployment blockers Other resolved 2018-05-08 2018-06-05
191053 1.32.0-wmf.7 deployment blockers Other resolved 2018-05-08 2018-06-13
191061 1.32.0-wmf.15 deployment blockers Other resolved 2018-07-06 2018-08-03
191062 1.32.0-wmf.16 deployment blockers Other resolved 2018-08-03 2018-08-09
191064 1.32.0-wmf.18 deployment blockers Other resolved 2018-08-04 2018-08-27
191065 1.32.0-wmf.19 deployment blockers Other resolved 2018-08-29 2018-09-04
191066 1.32.0-wmf.20 deployment blockers Other resolved 2018-08-31 2018-09-11
191077 zuul merge cloner might be broken Other resolved 2018-03-31 2018-03-30
191088 Release MW 1.31 Other resolved 2018-03-30 2018-06-13
191090 Run maintenance/updateCredits.php on master branch and upload changes to CREDITS for review. Other resolved 2018-03-30 2018-04-18
191233 Add missing dependencies for MediaWiki tests to quibble image Other resolved 2018-04-04 2018-04-03
191462 Git commit is missing from compiled Blubber version when packaged for Debian Other resolved 2018-04-05 2018-04-04
191865 Deploy "Deadlines" feature Other resolved 2018-04-11 2018-08-20
191921 mwscript rebuildLocalisationCache.php takes 40 minutes on HHVM (rather than ~5 on PHP 5) Other resolved 2018-04-11 2018-09-24
192124 Deploy Scap 3.8.0 to production Other resolved 2018-04-14 2018-04-20
192849 beta-scap-equiad failure: Error writing to CDB file Other resolved 2018-04-24 2018-07-02
193057 `quibble` fails with git 2.15: Type of packed-Refs not understood: '# pack-refs with: peeled fully-peeled sorted' Other resolved 2018-04-27 2018-07-01
193131 Quibble can not find NPM Other resolved 2018-07-03 2018-07-02
193202 Request access for deployment-prep Other resolved 2018-04-27 2018-07-01
193402 'resources/screen.less : Stylesheets should not both specify "media" and contain @media Other resolved 2018-07-11 2018-07-10
193403 truglass/handheld.css : Stylesheets should not both specify "media" and contain @media Other resolved 2018-07-11 2018-07-10
193404 [mediawiki/skins/Tempo] resources/tempo.css : Stylesheets should not both specify "media" and contain @media Other resolved 2018-07-11 2018-07-10
193767 Scribunto: Scribunto_LuaStandaloneInterpreterTest::testGetStatus Initial vsize Failed asserting that 0 is greater than 0 Other resolved 2018-05-04 2018-07-01
193883 `FATAL: java.io.IOException: java.nio.file.NoSuchFileException: ...build/screenshots.yml` for language-screenshots-VisualEditor Other resolved 2018-05-05 2018-07-02
193906 debian-glue errors out with: hooks/B90lintian: line 21: realpath: command not found Other resolved 2018-07-03 2018-07-02
194308 Transaction should be in the callback stage (not 'cursory') Other resolved 2018-07-03 2018-07-02
194773 Repository Ownership Request for user Zoranzoki21 for extension PushToWatch Other resolved 2018-07-03 2018-07-02
195634 quibble: with hhvm, "could not load extension asset expand.svg" due to lack of proper Content-Type header Other resolved 2018-05-26 2018-07-02
195783 [PropertySuggester] MWException from line 167 of /workspace/src/includes/Hooks.php: Invalid callback PropertySuggester\Hooks::onCreateSchema in hooks for LoadExtensionSchemaUpdates Other resolved 2018-07-03 2018-07-02
195831 [AkismetKlik] MWException Set $wgAKkey in LocalSettings.php or relevant configuration file. Other resolved 2018-07-03 2018-07-02
195864 Node.js Selenium framework lacks documentation Other resolved 2018-07-03 2018-07-02
195918 Move MediaWiki extension PHPUnit coverage jobs to docker + quibble Other resolved 2018-07-28 2018-09-24
196013 Get Wikibase + dependencies to run with Quibble Other resolved 2018-06-09 2018-09-24
196037 Add Backport Repository to Jenkins Package Build Other resolved 2018-06-09 2018-07-02
196062 EXT_DEPENDENCIES no more being injected on quibble jobs Other resolved 2018-07-02 2018-07-05
196431 [EditNotify] Invalid argument supplied for foreach() in extensions/EditNotify/EditNotify.hooks.php on line 917 Other resolved 2018-07-06 2018-07-05
196451 Add Candalua to the CI user whitelist Other resolved 2018-07-02 2018-07-01
196454 Is there a way to specify different different inter-extension-dependencies for REL-Branches? Other resolved 2018-07-02 2018-07-01
196510 [SocialLogin] $wgSocialLoginServices has no default triggering notice/warning Other resolved 2018-07-02 2018-07-01
196532 [Reflect] PHP Fatal error: Uncaught Error: Class 'LqtDispatch' not found in extensions/Reflect/server/classes/Dispatch.php:53 Other resolved 2018-07-03 2018-07-02
196565 Phabricator is very slow to load Other resolved 2018-06-09 2018-07-02
196800 Change rebase causes a Missing blob e959c00909e3b4ae11c26a58616a2d699883dcf3 Other resolved 2018-06-10 2018-07-02
196869 In Gerrit some users are reporting problems saving there preferences Other resolved 2018-06-12 2018-07-02
197204 Maintainer access for Wikimedia Commons Android Tools project Other resolved 2018-07-03 2018-07-02
197207 integration cumin can't ssh to instances: Connection closed by integration-cumin [preauth] Other resolved 2018-06-15 2018-07-03
197806 jsduck not found Other resolved 2018-06-21 2018-07-02
197933 CI no more inject extensions dependencies on REL branches Other resolved 2018-07-04 2018-07-03
198124 wdio: Cannot find module 'wdio-mediawiki/Util' from specs/page.js:8:9 Other resolved 2018-07-03 2018-07-02
198185 Scap sync --restart not working Other resolved 2018-06-27 2018-06-27
198229 [Graph] extension fails QUnit tests due to timeout Other resolved 2018-06-27 2018-07-05
198336 OpenStackManager tests fail on Quibble container: Error: Call to undefined function ldap_bind() Other resolved 2018-06-28 2018-07-08
198348 Quibble CI jobs time out after 30min due to instance stalling at "npm install parse" step Other resolved 2018-07-20 2018-07-27
198384 UploadWizard: Selenium tests failing Other resolved 2018-06-29 2018-07-02
198621 Scap3 doesn't support non us-ascii characters in config templates for service deployments Other resolved 2018-07-03 2018-07-11
198640 Perform scap canary checks after sync-wikiversions Other resolved 2018-07-03 2018-09-04
198973 Wikibase tests are failing CI on unrelated changes Other resolved 2018-07-07 2018-07-09
199047 Add "gmp" php extension to Quibble images Other resolved 2018-07-09 2018-07-09
199080 FormatJson should not be used in upper case form FormatJSON Other resolved 2018-07-10 2018-07-09
199460 Update gerrit to 2.15.3 Other resolved 2018-07-13 2018-07-27
199489 Helm test failing for CI namespace Other resolved 2018-07-13 2018-08-03
199592 releng.team should use HTTPS Other resolved 2018-07-15 2018-08-31
199742 TEC3:O1.1:Q1 Goal - Move verify stage from Minikube to CI k8s namespace in production context Other resolved 2018-07-17 2018-10-01
199746 Cleanup minikube instance from integration Other resolved 2018-07-17 2018-08-17
200017 Quibble should be able to be forced to run extensions testsuite when triggered from mediawiki/core Other resolved 2018-07-20 2018-09-24
200026 RepoGroup exceptions due to "false" being passed as a key to MapCacheLRU Other resolved 2018-07-20 2018-07-20
200063 [intersection] parser tests fail and CI ignore tests Other resolved 2018-07-21 2018-07-20
200669 Help needed to setup the elastic6 dev branch on CirrusSearch, Elastica and mediawiki-vendor Other resolved 2018-07-31 2018-07-31
201224 Jenkins should auto-depool nodes if they run out of disk space on specific partitions Other resolved 2018-08-22 2018-08-31
201306 Revoke the volunteer badge from my account Other resolved 2018-08-07 2018-08-06
201460 Unable to log in to Phabricator via MediaWiki on mobile (CSP error) Other resolved 2018-08-10 2018-08-24
201972 Add some more m4executor docker slaves for Jenkins Other resolved 2018-08-15 2018-09-20
202068 Move path for blubber.yaml to ./.pipeline/blubber.yaml for all blubber jobs Other resolved 2018-08-17 2018-08-27
202222 Phabricator DB query request: list repositories and assigned callsigns Other resolved 2018-08-21 2018-08-28
202412 [BlueSpiceAvatars] PHP Notice BS_DATA_DIR / BS_DATA_PATH Other resolved 2018-08-25 2018-09-19
202457 mediawiki-quibble docker jobs fails due to disk full Other resolved 2018-08-22 2018-10-01
202483 www.mediawiki.org showing: error:Unknown database 'wikidatawiki' on shard: s3 Other resolved 2018-08-23 2018-08-22
202523 Migrate parsoidsvc-hhvm-parsertests-jessie off of Nodepool Other resolved 2018-08-23 2018-08-22
202710 Xvfb causes _XSERVTransmkdir: ERROR: euid != 0,directory /tmp/.X11-unix will not be created Other resolved 2018-08-25 2018-09-24
203093 Add service-pipeline to zuul for Graphoid Other resolved 2018-08-30 2018-08-29
203178 Migrate Selenium tests based on the ruby library mediawiki_selenium Other resolved 2018-08-31 2018-09-24
203271 Update Debian Package for Scap to 3.8.5-1 Other resolved 2018-09-01 2018-09-04
203841 Provide dedicated storage space to Docker for images/containers Other resolved 2018-09-08 2018-09-13
203902 Rebuild quibble images for Chrome 69 and Firefox 60 Other resolved 2018-09-13 2018-09-13
204214 mwselenium-quibble-docker jobs broken on WikibaseLexeme Other resolved 2018-09-14 2018-09-17
204710 make-wmf-branch: no permission on lib/ve VisualEditor submodule Other resolved 2018-09-19 2018-09-18
204757 [OAuth] PHP Fatal Error: Call to undefined method MediaWiki\Extensions\OAuth\MWOAuthDAOAccessControl::getForHtml() Other resolved 2018-09-19 2018-09-18